Reaction Details
TargetOxytocin receptor
LigandBDBM50177595
Substrate/Competitorn/a
Meas. Tech.ChEMBL_334047 (CHEMBL861269)
IC50 12±n/a nM
Citation Failli, AAShumsky, JSSteffan, RJCaggiano, TJWilliams, DKTrybulski, EJNing, XLock, YTanikella, THartmann, DChan, PSPark, CH Pyridobenzodiazepines: a novel class of orally active, vasopressin V2 receptor selective agonists. Bioorg Med Chem Lett16:954-9 (2006) 
 
Oxytocin receptor
Name:Oxytocin receptor
Type:Enzyme Catalytic Domain
Mol. Mass.:42889.28
Organism:RAT
Description:Oxytocin OXTR RAT::P70536
Residue:388
BDBM50177595
NameBDBM50177595
Synonyms:(2S)-5-amino-2-{[(2S)-1-{[(4R,7S,10S,13S,16R)-13-[(2S)-butan-2-yl]-7-(carbamoylmethyl)-16-[(4-ethoxyphenyl)methyl]-10-[(1R)-1-hydroxyethyl]-6,9,12,15,18-pentaoxo-1,2-dithia-5,8,11,14,17-pentaazacycloicosan-4-yl]carbonyl}pyrrolidin-2-yl]formamido}-N-(carbamoylmethyl)pentanamide CHEMBL382301 | ChEMBL_332615
TypeSmall organic molecule
Emp. Form.C43H67N11O12S2
Mol. Mass.994.189
SMILESCCOc1ccc(C[C@H]2NC(=O)CCSSC[C@H](NC(=O)[C@H](CC(N)=O)NC(=O)[C@@H](NC(=O)[C@@H](NC2=O)[C@@H](C)CC)[C@@H](C)O)C(=O)N2CCC[C@H]2C(=O)N[C@@H](CCCN)C(=O)NCC(N)=O)cc1