Reaction Details
TargetDNA polymerase III PolC-type
LigandBDBM21686
Substrate/Competitorn/a
Meas. Tech.ChEMBL_334242 (CHEMBL861887)
Ki 66±n/a nM
Citation Zhi, CLong, ZYManikowski, AComstock, JXu, WCBrown, NCTarantino, PMHolm, KADix, EJWright, GEBarnes, MHButler, MMFoster, KALaMarr, WABachand, BBethell, RCadilhac, CCharron, SLamothe, SMotorina, IStorer, R Hybrid antibacterials. DNA polymerase-topoisomerase inhibitors. J Med Chem49:1455-65 (2006) 
 
DNA polymerase III PolC-type
Name:DNA polymerase III PolC-type
Type:Enzyme
Mol. Mass.:162625.67
Organism:Bacillus subtilis
Description:Enzyme was purified from recombinant strains.
Residue:1437
BDBM21686
NameBDBM21686
Synonyms:3-(4-hydroxybutyl)-6-(3-ethyl-4-methylanilino)uracil CHEMBL327687 HBEMAU
TypeSmall organic molecule
Emp. Form.C17H23N3O3
Mol. Mass.317.3828
SMILESCCc1cc(Nc2cc(=O)n(CCCCO)c(=O)[nH]2)ccc1C