Reaction Details
TargetEpidermal growth factor receptor
LigandBDBM50182697
Substrate/Competitorn/a
Meas. Tech.ChEMBL_334486 (CHEMBL862515)
IC50 1.9±n/a nM
Citation Klutchko, SRZhou, HWinters, RTTran, TPBridges, AJAlthaus, IWAmato, DMElliott, WLEllis, PAMeade, MARoberts, BJFry, DWGonzales, AJHarvey, PJNelson, JMSherwood, VHan, HKPace, GSmaill, JBDenny, WAShowalter, HD Tyrosine kinase inhibitors. 19. 6-Alkynamides of 4-anilinoquinazolines and 4-anilinopyrido[3,4-d]pyrimidines as irreversible inhibitors of the erbB family of tyrosine kinase receptors. J Med Chem49:1475-85 (2006) 
 
Epidermal growth factor receptor
Name:Epidermal growth factor receptor
Type:Receptor Kinase Domain
Mol. Mass.:134279.59
Organism:Homo sapiens (Human)
Description:P00533
Residue:1210
BDBM50182697
NameBDBM50182697
Synonyms:CHEMBL203599 | N-[4-[(3-chloro-4-fluorophenyl)amino]pyrido[3,4-d]pyrimidin-6-yl]-5-(4-methyl-1-piperazinyl)-2-pentynamide
TypeSmall organic molecule
Emp. Form.C23H23ClFN7O
Mol. Mass.467.926
SMILESCN1CCN(CCC#CC(=O)Nc2cc3c(Nc4ccc(F)c(Cl)c4)ncnc3cn2)CC1