Reaction Details
TargetMu-type opioid receptor
LigandBDBM50183555
Substrate/Competitorn/a
Meas. Tech.ChEMBL_335165 (CHEMBL861287)
Ki 88±n/a nM
Citation Lee, YSAgnes, RSBadghisi, HDavis, PMa, SWLai, JPorreca, FHruby, VJ Design and synthesis of novel hydrazide-linked bifunctional peptides as delta/mu opioid receptor agonists and CCK-1/CCK-2 receptor antagonists. J Med Chem49:1773-80 (2006) 
 
Mu-type opioid receptor
Name:Mu-type opioid receptor
Type:G Protein-Coupled Receptor (GPCR)
Mol. Mass.:44503.11
Organism:Rattus norvegicus (rat)
Description:Competition binding assays were carried out using membrane preparations from transfected HN9.10 cells that constitutively expressed the mu opioid receptor.
Residue:398
BDBM50183555
NameBDBM50183555
Synonyms:CHEMBL408832 | H-Tyr-D-Ala-Gly-Phe-NH-NH-Phe-Asp-Nle-D-Trp-1-Adoc
TypeSmall organic molecule
Emp. Form.C64H77N9O15
Mol. Mass.1212.3475
SMILESCCCC[C@H](NC(=O)[C@H](CC(O)=O)NC(=O)[C@H](Cc1ccccc1)NN[C@@H](Cc1ccccc1)C(=O)NCC(=O)N[C@H](C)C(=O)N[C@@H](Cc1ccc(O)cc1)C(O)=O)C(=O)N[C@H](Cc1cn(C(=O)OC23CC4CC(CC(C4)C2)C3)c2ccccc12)C(O)=O