Reaction Details
TargetCholecystokinin receptor type A
LigandBDBM50183552
Substrate/Competitorn/a
Meas. Tech.ChEMBL_335166 (CHEMBL861288)
Ki 1000±n/a nM
Citation Lee, YSAgnes, RSBadghisi, HDavis, PMa, SWLai, JPorreca, FHruby, VJ Design and synthesis of novel hydrazide-linked bifunctional peptides as delta/mu opioid receptor agonists and CCK-1/CCK-2 receptor antagonists. J Med Chem49:1773-80 (2006) 
 
Cholecystokinin receptor type A
Name:Cholecystokinin receptor type A
Type:G Protein-Coupled Receptor (GPCR)
Mol. Mass.:47859.34
Organism:Homo sapiens (Human)
Description:Stable expression of human CCK-1 receptors in HEK 293 cells.
Residue:428
BDBM50183552
NameBDBM50183552
Synonyms:CHEMBL412331 | H-Tyr-D-Ala-Gly-Phe-NH-NH-(NMe)Phe-Asp-Lys(Cpac)-Trp-Ac
TypeSmall organic molecule
Emp. Form.C63H71ClN10O15
Mol. Mass.1243.749
SMILESCCCC[C@H](N(C(=O)Nc1ccccc1Cl)C(=O)[C@H](CC(O)=O)NC(=O)[C@H](Cc1ccccc1)N(C)N[C@@H](Cc1ccccc1)C(=O)NCC(=O)N[C@H](C)C(=O)N[C@@H](Cc1ccc(O)cc1)C(O)=O)C(=O)N[C@@H](Cc1cn(C(C)=O)c2ccccc12)C(O)=O