Reaction Details
TargetCysteine protease
LigandBDBM50286441
Substrate/Competitorn/a
Meas. Tech.ChEMBL_336666 (CHEMBL862349)
IC50 10±n/a nM
Citation Desai, PVPatny, AGut, JRosenthal, PJTekwani, BSrivastava, AAvery, M Identification of novel parasitic cysteine protease inhibitors by use of virtual screening. 2. The available chemical directory. J Med Chem49:1576-84 (2006) 
 
Cysteine protease
Name:Cysteine protease
Synonyms:n/a
Type:PROTEIN
Mol. Mass.:42630.50
Organism:Leishmania donovani
Description:ChEMBL_430130
Residue:394
BDBM50286441
NameBDBM50286441
TypeSmall organic molecule
Emp. Form.C20H38N6O5
Mol. Mass.442.5529
SMILESCC(C)C[C@H](NC(C)=O)C(=O)N[C@@H](CC(C)C)C(=O)N[C@@H](CCCNC(N)=N)C(O)=O