Reaction Details
TargetCysteine protease falcipain-3 [5-492]
LigandBDBM50183397
Substrate/Competitorn/a
Meas. Tech.ChEMBL_336665 (CHEMBL862348)
IC50 31200±n/a nM
Citation Desai, PVPatny, AGut, JRosenthal, PJTekwani, BSrivastava, AAvery, M Identification of novel parasitic cysteine protease inhibitors by use of virtual screening. 2. The available chemical directory. J Med Chem49:1576-84 (2006) 
 
Cysteine protease falcipain-3 [5-492]
Name:Cysteine protease falcipain-3 [5-492]
Type:PROTEIN
Mol. Mass.:56106.86
Organism:Plasmodium falciparum
Description:ChEMBL_430127
Residue:488
BDBM50183397
NameBDBM50183397
Synonyms:CHEMBL440764 | ethyl 2-(2-(furan-2-ylmethylamino)-2-oxoethoxy)pyrido[1,2-a]indole-10-carboxylate
TypeSmall organic molecule
Emp. Form.C22H20N2O5
Mol. Mass.392.4046
SMILESCCOC(=O)c1c2cc(OCC(=O)NCc3ccco3)ccc2n2ccccc12