Reaction Details
TargetTGF-beta receptor type-1
LigandBDBM50184879
Substrate/Competitorn/a
Meas. Tech.ChEMBL_342367 (CHEMBL860750)
IC50 15±n/a nM
Citation Gellibert, Fde Gouville, ACWoolven, JMathews, NNguyen, VLBertho-Ruault, CPatikis, AGrygielko, ETLaping, NJHuet, S Discovery of 4-{4-[3-(pyridin-2-yl)-1H-pyrazol-4-yl]pyridin-2-yl}-N-(tetrahydro-2H- pyran-4-yl)benzamide (GW788388): a potent, selective, and orally active transforming growth factor-beta type I receptor inhibitor. J Med Chem49:2210-21 (2006) 
 
TGF-beta receptor type-1
Name:TGF-beta receptor type-1
Type:enzyme
Mol. Mass.:55968.24
Organism:Homo sapiens (Human)
Description:P36897
Residue:503
BDBM50184879
NameBDBM50184879
Synonyms:CHEMBL424676 | dimethyl-{2-[(4-{4-[3-(pyridin-2-yl)-1H-pyrazol-4-yl]-2-pyridinyl}phenyl)oxy]ethyl}amine
TypeSmall organic molecule
Emp. Form.C23H23N5O
Mol. Mass.385.4616
SMILESCN(C)CCOc1ccc(cc1)-c1cc(ccn1)-c1c[nH]nc1-c1ccccn1