Reaction Details
TargetCytochrome P450 2D6
LigandBDBM50185241
Substrate/Competitorn/a
Meas. Tech.ChEMBL_343532 (CHEMBL860702)
IC50>1000000±n/a nM
Citation de Graaf, COostenbrink, CKeizers, PHvan der Wijst, TJongejan, AVermeulen, NP Catalytic site prediction and virtual screening of cytochrome P450 2D6 substrates by consideration of water and rescoring in automated docking. J Med Chem49:2417-30 (2006) 
 
Cytochrome P450 2D6
Name:Cytochrome P450 2D6
Type:Protein
Mol. Mass.:55774.82
Organism:Homo sapiens (Human)
Description:P10635
Residue:497
BDBM50185241
NameBDBM50185241
Synonyms:2-((phenylimino)methyl)phenol GBR-11840
TypeSmall organic molecule
Emp. Form.C13H11NO
Mol. Mass.197.2325
SMILESOc1ccccc1\C=N\c1ccccc1