Reaction Details
TargetCytochrome P450 2D6
LigandBDBM50185243
Substrate/Competitorn/a
Meas. Tech.ChEMBL_343532 (CHEMBL860702)
IC50>200000±n/a nM
Citation de Graaf, COostenbrink, CKeizers, PHvan der Wijst, TJongejan, AVermeulen, NP Catalytic site prediction and virtual screening of cytochrome P450 2D6 substrates by consideration of water and rescoring in automated docking. J Med Chem49:2417-30 (2006) 
 
Cytochrome P450 2D6
Name:Cytochrome P450 2D6
Type:Protein
Mol. Mass.:55774.82
Organism:Homo sapiens (Human)
Description:P10635
Residue:497
BDBM50185243
NameBDBM50185243
Synonyms:5-benzylidene-10,11-dihydro-5H-dibenzo[a,d]cycloheptene | CHEMBL382564
TypeSmall organic molecule
Emp. Form.C22H18
Mol. Mass.282.3783
SMILES[#6]-1-[#6]-c2ccccc2\[#6](=[#6]/c2ccccc2)-c2ccccc-12