Reaction Details
TargetCytochrome P450 2D6
LigandBDBM50185248
Substrate/Competitorn/a
Meas. Tech.ChEMBL_343532 (CHEMBL860702)
IC50 210±n/a nM
Citation de Graaf, COostenbrink, CKeizers, PHvan der Wijst, TJongejan, AVermeulen, NP Catalytic site prediction and virtual screening of cytochrome P450 2D6 substrates by consideration of water and rescoring in automated docking. J Med Chem49:2417-30 (2006) 
 
Cytochrome P450 2D6
Name:Cytochrome P450 2D6
Type:Protein
Mol. Mass.:55774.82
Organism:Homo sapiens (Human)
Description:P10635
Residue:497
BDBM50185248
NameBDBM50185248
Synonyms:CHEMBL203446 | GBR 12530
TypeSmall organic molecule
Emp. Form.C25H26
Mol. Mass.326.4739
SMILES[#6]-[#6]-1-[#6]-2-[#6]-[#6]-[#6]-1-[#6]=[#6](-[#6]-2)\[#6]=[#6]-1/c2ccccc2-[#6]-[#6]-c2ccccc-12