Reaction Details
TargetCytochrome P450 2D6
LigandBDBM50185255
Substrate/Competitorn/a
Meas. Tech.ChEMBL_343532 (CHEMBL860702)
IC50 40000±n/a nM
Citation de Graaf, COostenbrink, CKeizers, PHvan der Wijst, TJongejan, AVermeulen, NP Catalytic site prediction and virtual screening of cytochrome P450 2D6 substrates by consideration of water and rescoring in automated docking. J Med Chem49:2417-30 (2006) 
 
Cytochrome P450 2D6
Name:Cytochrome P450 2D6
Type:Protein
Mol. Mass.:55774.82
Organism:Homo sapiens (Human)
Description:P10635
Residue:497
BDBM50185255
NameBDBM50185255
Synonyms:7-methyl-5-pyrrol-1-yl-10,11-dihydro-5H-benzo[4,5]cyclohepta[1,2-b]pyridine | CHEMBL205183
TypeSmall organic molecule
Emp. Form.C19H18N2
Mol. Mass.274.3596
SMILESCc1ccc2CCc3ncccc3C(c2c1)n1cccc1