Reaction Details
TargetSodium-dependent noradrenaline transporter
LigandBDBM50180527
Substrate/Competitorn/a
Meas. Tech.ChEMBL_344145 (CHEMBL868869)
Ki 148±n/a nM
Citation Cases-Thomas, MJMasters, JJWalter, MWCampbell, GHaughton, LGallagher, PTDobson, DRMancuso, VBonnier, BGiard, TDefrance, TVanmarsenille, MLedgard, AWhite, COuwerkerk-Mahadevan, SBrunelle, FJDezutter, NAHerbots, CALienard, JYFindlay, JHayhurst, LBoot, JThompson, LKHemrick-Luecke, S Discovery of novel and selective tertiary alcohol containing inhibitors of the norepinephrine transporter. Bioorg Med Chem Lett16:2022-5 (2006) 
 
Sodium-dependent noradrenaline transporter
Name:Sodium-dependent noradrenaline transporter
Type:Multi-pass membrane protein
Mol. Mass.:69337.72
Organism:Homo sapiens (Human)
Description:P23975
Residue:617
BDBM50180527
NameBDBM50180527
Synonyms:(R)-1-((S)-morpholin-2-yl)-1,2-diphenylethanol | CHEMBL207712
TypeSmall organic molecule
Emp. Form.C18H21NO2
Mol. Mass.283.3648
SMILESO[C@@](Cc1ccccc1)([C@@H]1CNCCO1)c1ccccc1