Reaction Details
TargetProtein kinase C delta type
LigandBDBM50182212
Substrate/Competitorn/a
Meas. Tech.ChEMBL_346251 (CHEMBL861206)
IC50>125000±n/a nM
Citation McDermott, LAHiggins, BSimcox, MLuk, KCNevins, TKolinsky, KSmith, MYang, HLi, JKChen, YKe, JMallalieu, NEgan, TKolis, SRailkar, AGerber, LLiu, JJKonzelmann, FZhang, ZFlynn, TMorales, OChen, Y Biological evaluation of a multi-targeted small molecule inhibitor of tumor-induced angiogenesis. Bioorg Med Chem Lett16:1950-3 (2006) 
 
Protein kinase C delta type
Name:Protein kinase C delta type
Type:Enzyme
Mol. Mass.:77516.79
Organism:Homo sapiens (Human)
Description:The recombinant human PKC enzymes were produced using a baculovirus expression system in SF9 cells
Residue:676
BDBM50182212
NameBDBM50182212
Synonyms:7-(4-fluorophenylamino)-1-((1S,3R)-3-hydroxycyclopentyl)-3-(4-methoxyphenyl)-3,4-dihydropyrimido[4,5-d]pyrimidin-2(1H)-one
TypeSmall organic molecule
Emp. Form.C24H24FN5O3
Mol. Mass.449.4775
SMILESCOc1ccc(cc1)N1Cc2cnc(Nc3ccc(F)cc3)nc2N(C2CC[C@@H](O)C2)C1=O