Reaction Details
TargetAcetylcholinesterase
LigandBDBM14754
Substrate/Competitorn/a
Meas. Tech.ChEMBL_347063 (CHEMBL866863)
IC50 24330±n/a nM
Citation Markmee, SRuchirawat, SPrachyawarakorn, VIngkaninan, KKhorana, N Isoquinoline derivatives as potential acetylcholinesterase inhibitors. Bioorg Med Chem Lett16:2170-2 (2006) 
 
Acetylcholinesterase
Name:Acetylcholinesterase
Type:Enzyme
Mol. Mass.:67792.70
Organism:Homo sapiens (Human)
Description:P22303
Residue:614
BDBM14754
NameBDBM14754
Synonyms:1-[(3,4-dimethoxyphenyl)methyl]-6,7-dimethoxy-isoquinoline 6,7-dimethoxy-1-veratryl-isoquinoline;hydrochloride Papaverine
TypeSmall organic molecule
Emp. Form.C20H21NO4
Mol. Mass.339.385
SMILESCOc1ccc(Cc2nccc3cc(OC)c(OC)cc23)cc1OC