Reaction Details
TargetCarbonic anhydrase 1
LigandBDBM10874
Substrate/Competitorn/a
Meas. Tech.ChEMBL_347175 (CHEMBL863823)
Ki 95±n/a nM
Citation Nishimori, IVullo, DMinakuchi, TMorimoto, KOnishi, SScozzafava, ASupuran, CT Carbonic anhydrase inhibitors: cloning and sulfonamide inhibition studies of a carboxyterminal truncated alpha-carbonic anhydrase from Helicobacter pylori. Bioorg Med Chem Lett16:2182-8 (2006) 
 
Carbonic anhydrase 1
Name:Carbonic anhydrase 1
Type:Enzyme
Mol. Mass.:28873.37
Organism:Homo sapiens (Human)
Description:P00915
Residue:261
BDBM10874
NameBDBM10874
Synonyms:6-hydroxy-1,3-benzothiazole-2-sulfonamide aromatic/heteroaromatic sulfonamide 19
TypeSmall organic molecule
Emp. Form.C7H6N2O3S2
Mol. Mass.230.264
SMILESNS(=O)(=O)c1nc2ccc(O)cc2s1