Reaction Details
TargetCarbonic anhydrase 2
LigandBDBM10870
Substrate/Competitorn/a
Meas. Tech.ChEMBL_347176 (CHEMBL863824)
Ki 2±n/a nM
Citation Nishimori, IVullo, DMinakuchi, TMorimoto, KOnishi, SScozzafava, ASupuran, CT Carbonic anhydrase inhibitors: cloning and sulfonamide inhibition studies of a carboxyterminal truncated alpha-carbonic anhydrase from Helicobacter pylori. Bioorg Med Chem Lett16:2182-8 (2006) 
 
Carbonic anhydrase 2
Name:Carbonic anhydrase 2
Type:Enzyme
Mol. Mass.:29250.71
Organism:Homo sapiens (Human)
Description:P00918
Residue:260
BDBM10870
NameBDBM10870
Synonyms:2-N-(4-aminobenzene)-1,3,4-thiadiazole-2,5-disulfonamide CHEMBL268439 aminobenzolamide deriv. 43 | aromatic/heteroaromatic sulfonamide 15
TypeSmall organic molecule
Emp. Form.C8H9N5O4S3
Mol. Mass.335.383
SMILESNc1ccc(cc1)S(=O)(=O)Nc1nnc(s1)S(N)(=O)=O