Reaction Details
TargetAdenosine receptor A3
LigandBDBM50182963
Substrate/Competitorn/a
Meas. Tech.ChEMBL_350240 (CHEMBL861501)
Ki 1.91±n/a nM
Citation Zhu, RFrazier, CRLinden, JMacdonald, TL N6-ethyl-2-alkynyl NECAs, selective human A3 adenosine receptor agonists. Bioorg Med Chem Lett16:2416-8 (2006) 
 
Adenosine receptor A3
Name:Adenosine receptor A3
Type:G Protein-Coupled Receptor (GPCR)
Mol. Mass.:36197.32
Organism:Homo sapiens (Human)
Description:P0DMS8
Residue:318
BDBM50182963
NameBDBM50182963
Synonyms:(2S,3S,4R,5R)-N-ethyl-5-(6-(ethylamino)-2-(2-(1-hydroxycyclohexyl)ethynyl)-9H-purin-9-yl)-3,4-dihydroxy-tetrahydrofuran-2-carboxamide | CHEMBL205531
TypeSmall organic molecule
Emp. Form.C22H30N6O5
Mol. Mass.458.5108
SMILESCCNC(=O)[C@H]1O[C@H]([C@H](O)[C@@H]1O)n1cnc2c(NCC)nc(nc12)C#CC1(O)CCCCC1