Reaction Details
TargetAdenosine receptor A3
LigandBDBM50182974
Substrate/Competitorn/a
Meas. Tech.ChEMBL_350240 (CHEMBL861501)
Ki 0.542±n/a nM
Citation Zhu, RFrazier, CRLinden, JMacdonald, TL N6-ethyl-2-alkynyl NECAs, selective human A3 adenosine receptor agonists. Bioorg Med Chem Lett16:2416-8 (2006) 
 
Adenosine receptor A3
Name:Adenosine receptor A3
Type:G Protein-Coupled Receptor (GPCR)
Mol. Mass.:36197.32
Organism:Homo sapiens (Human)
Description:P0DMS8
Residue:318
BDBM50182974
NameBDBM50182974
Synonyms:(2S,3S,4R,5R)-N-ethyl-5-(6-(ethylamino)-2-((S)-3-hydroxyoct-1-ynyl)-9H-purin-9-yl)-3,4-dihydroxy-tetrahydrofuran-2-carboxamide | CHEMBL376968
TypeSmall organic molecule
Emp. Form.C22H32N6O5
Mol. Mass.460.5267
SMILESCCCCC[C@H](O)C#Cc1nc(NCC)c2ncn([C@@H]3O[C@@H]([C@@H](O)[C@H]3O)C(=O)NCC)c2n1