Reaction Details
TargetAdenosine receptor A3
LigandBDBM50182980
Substrate/Competitorn/a
Meas. Tech.ChEMBL_350240 (CHEMBL861501)
Ki 1.98±n/a nM
Citation Zhu, RFrazier, CRLinden, JMacdonald, TL N6-ethyl-2-alkynyl NECAs, selective human A3 adenosine receptor agonists. Bioorg Med Chem Lett16:2416-8 (2006) 
 
Adenosine receptor A3
Name:Adenosine receptor A3
Type:G Protein-Coupled Receptor (GPCR)
Mol. Mass.:36197.32
Organism:Homo sapiens (Human)
Description:P0DMS8
Residue:318
BDBM50182980
NameBDBM50182980
Synonyms:(2S,3S,4R,5R)-N-ethyl-5-(6-(ethylamino)-2-((R,S)-3-hydroxy-3-(2-methoxyphenyl)prop-1-ynyl)-9H-purin-9-yl)-3,4-dihydroxy-tetrahydrofuran-2-carboxamide | CHEMBL205327
TypeSmall organic molecule
Emp. Form.C24H28N6O6
Mol. Mass.496.5157
SMILESCCNC(=O)[C@H]1O[C@H]([C@H](O)[C@@H]1O)n1cnc2c(NCC)nc(nc12)C#CC(O)c1ccccc1OC