Reaction Details
TargetAdenosine receptor A3
LigandBDBM50134814
Substrate/Competitorn/a
Meas. Tech.ChEMBL_351400 (CHEMBL870057)
Ki 850±n/a nM
Citation Gao, ZGDuong, HTSonina, TKim, SKVan Rompaey, PVan Calenbergh, SMamedova, LKim, HOKim, MJKim, AYLiang, BTJeong, LSJacobson, KA Orthogonal activation of the reengineered A3 adenosine receptor (neoceptor) using tailored nucleoside agonists. J Med Chem49:2689-702 (2006) 
 
Adenosine receptor A3
Name:Adenosine receptor A3
Type:G Protein-Coupled Receptor (GPCR)
Mol. Mass.:36197.32
Organism:Homo sapiens (Human)
Description:P0DMS8
Residue:318
BDBM50134814
NameBDBM50134814
Synonyms:(2R,3R,4S,5S)-2-(6-(3-iodobenzylamino)-9H-purin-9-yl)-4-(aminomethyl)-5-(hydroxymethyl)-tetrahydrofuran-3-ol CHEMBL144521
TypeSmall organic molecule
Emp. Form.C18H21IN6O3
Mol. Mass.496.3022
SMILESNC[C@@H]1[C@@H](CO)O[C@H]([C@@H]1O)n1cnc2c(NCc3cccc(I)c3)ncnc12