Reaction Details
TargetAdenosine receptor A3
LigandBDBM50185933
Substrate/Competitorn/a
Meas. Tech.ChEMBL_351396 (CHEMBL870047)
Ki 700±n/a nM
Citation Gao, ZGDuong, HTSonina, TKim, SKVan Rompaey, PVan Calenbergh, SMamedova, LKim, HOKim, MJKim, AYLiang, BTJeong, LSJacobson, KA Orthogonal activation of the reengineered A3 adenosine receptor (neoceptor) using tailored nucleoside agonists. J Med Chem49:2689-702 (2006) 
 
Adenosine receptor A3
Name:Adenosine receptor A3
Type:G Protein-Coupled Receptor (GPCR)
Mol. Mass.:36197.32
Organism:Homo sapiens (Human)
Description:P0DMS8
Residue:318
BDBM50185933
NameBDBM50185933
Synonyms:CHEMBL207610 | N-(((2S,3S,4R,5R)-5-(6-(3-iodobenzylamino)-9H-purin-9-yl)-4-hydroxy-2-(hydroxymethyl)-tetrahydrofuran-3-yl)methyl)acetamide
TypeSmall organic molecule
Emp. Form.C20H23IN6O4
Mol. Mass.538.3389
SMILESCC(=O)NC[C@@H]1[C@@H](CO)O[C@H]([C@@H]1O)n1cnc2c(NCc3cccc(I)c3)ncnc12