Reaction Details
TargetProthrombin
LigandBDBM50182201
Substrate/Competitorn/a
Meas. Tech.ChEBML_354126
IC50 1±n/a nM
Citation Mack, HBaucke, DHornberger, WLange, UESeitz, WHöffken, HW Orally active thrombin inhibitors. Part 1: optimization of the P1-moiety. Bioorg Med Chem Lett16:2641-7 (2006) 
 
Prothrombin
Name:Prothrombin
Type:Protein
Mol. Mass.:70029.57
Organism:Homo sapiens (Human)
Description:P00734
Residue:622
BDBM50182201
NameBDBM50182201
Synonyms:((R)-2-{(S)-2-[(6-carbamimidoyl-pyridin-3-ylmethyl)-carbamoyl]-2,5-dihydro-pyrrol-1-yl}-1-cyclohexylmethyl-2-oxo-ethylamino)-acetic acid CHEMBL377681
TypeSmall organic molecule
Emp. Form.C23H32N6O4
Mol. Mass.456.538
SMILESNC(=N)c1ccc(CNC(=O)[C@@H]2C=CCN2C(=O)[C@@H](CC2CCCCC2)NCC(O)=O)cn1