Reaction Details
TargetProthrombin
LigandBDBM50182198
Substrate/Competitorn/a
Meas. Tech.ChEMBL_354267 (CHEMBL870018)
IC50 1±n/a nM
Citation Lange, UEBaucke, DHornberger, WMack, HSeitz, WHöffken, HW Orally active thrombin inhibitors. Part 2: optimization of the P2-moiety. Bioorg Med Chem Lett16:2648-53 (2006) 
 
Prothrombin
Name:Prothrombin
Type:Protein
Mol. Mass.:70029.57
Organism:Homo sapiens (Human)
Description:P00734
Residue:622
BDBM50182198
NameBDBM50182198
Synonyms:((R)-2-{(S)-2-[(5-carbamimidoyl-thiophen-2-ylmethyl)-carbamoyl]-pyrrolidin-1-yl}-1-cyclohexylmethyl-2-oxo-ethylamino)-acetic acid N-(CARBOXYMETHYL)-3-CYCLOHEXYL-D-ALANYL-N-({5-[(E)-AMINO(IMINO)METHYL]THIEN-2-YL}METHYL)-L-PROLINAMIDE
TypeSmall organic molecule
Emp. Form.C22H33N5O4S
Mol. Mass.463.594
SMILESNC(=N)c1ccc(CNC(=O)[C@@H]2CCCN2C(=O)[C@@H](CC2CCCCC2)NCC(O)=O)s1