Reaction Details
TargetTyrosine-protein phosphatase non-receptor type 1
LigandBDBM23195
Substrate/Competitorn/a
Meas. Tech.ChEMBL_358378 (CHEMBL854300)
IC50 13800±n/a nM
Citation Na, MCui, LMin, BSBae, KYoo, JKKim, BYOh, WKAhn, JS Protein tyrosine phosphatase 1B inhibitory activity of triterpenes isolated from Astilbe koreana. Bioorg Med Chem Lett16:3273-6 (2006) 
 
Tyrosine-protein phosphatase non-receptor type 1
Name:Tyrosine-protein phosphatase non-receptor type 1
Type:Protein phosphatase
Mol. Mass.:49963.76
Organism:Homo sapiens (Human)
Description:Human recombinant GST-fusion PTP1B (1-435).
Residue:435
BDBM23195
NameBDBM23195
Synonyms:(2S,4aS,6aS,6bR,10S,12aS,12bR,14bR)-10-hydroxy-2,4a,6a,6b,9,9,12a-heptamethyl-13-oxo-1,2,3,4,4a,5,6,6a,6b,7,8,8a,9,10,11,12,12a,12b,13,14b-icosahydropicene-2-carboxylic acid Glycyrrhetinic Acid, 8 | pentacyclic triterpene compound 8
TypeTerpene
Emp. Form.C30H46O4
Mol. Mass.470.6838
SMILES[H][C@@]12C[C@](C)(CC[C@]1(C)CC[C@]1(C)C2=CC(=O)[C@]2([H])[C@@]3(C)CC[C@H](O)C(C)(C)C3CC[C@@]12C)C(O)=O