Reaction Details
TargetProteasome subunit beta type-5
LigandBDBM50185155
Substrate/Competitorn/a
Meas. Tech.ChEMBL_359171 (CHEMBL869330)
IC50 4150±n/a nM
Citation Marastoni, MBaldisserotto, ATrapella, CGavioli, RTomatis, R P3 and P4 position analysis of vinyl ester pseudopeptide proteasome inhibitors. Bioorg Med Chem Lett16:3125-30 (2006) 
 
Proteasome subunit beta type-5
Name:Proteasome subunit beta type-5
Type:Protein
Mol. Mass.:28480.96
Organism:Homo sapiens (Human)
Description:n/a
Residue:263
BDBM50185155
NameBDBM50185155
Synonyms:CHEMBL207774 | H-Phe-Val-Gln-Leu-VE
TypeSmall organic molecule
Emp. Form.C29H45N5O6
Mol. Mass.559.6975
SMILESCCOC(=O)\C=C\[C@H](CC(C)C)NC(=O)[C@H](CCC(N)=O)NC(=O)[C@@H](NC(=O)[C@@H](N)Cc1ccccc1)C(C)C