Reaction Details
Target3-oxoacyl-acyl-carrier protein reductase
LigandBDBM50153015
Substrate/Competitorn/a
Meas. Tech.ChEMBL_361105 (CHEMBL859171)
IC50 1000±n/a nM
Citation Tasdemir, DLack, GBrun, RRüedi, PScapozza, LPerozzo, R Inhibition of Plasmodium falciparum fatty acid biosynthesis: evaluation of FabG, FabZ, and FabI as drug targets for flavonoids. J Med Chem49:3345-53 (2006) 
 
3-oxoacyl-acyl-carrier protein reductase
Name:3-oxoacyl-acyl-carrier protein reductase
Synonyms:n/a
Type:PROTEIN
Mol. Mass.:33333.53
Organism:Plasmodium falciparum
Description:ChEMBL_675156
Residue:301
BDBM50153015
NameBDBM50153015
TypeSmall organic molecule
Emp. Form.C22H18O10
Mol. Mass.442.3723
SMILESOc1cc(O)c2C[C@@H](OC(=O)c3cc(O)c(O)c(O)c3)[C@H](Oc2c1)c1ccc(O)c(O)c1