Reaction Details
Target3-oxoacyl-acyl-carrier protein reductase
LigandBDBM7459
Substrate/Competitorn/a
Meas. Tech.ChEMBL_361112 (CHEMBL859178)
Ki 800±n/a nM
Citation Tasdemir, DLack, GBrun, RRüedi, PScapozza, LPerozzo, R Inhibition of Plasmodium falciparum fatty acid biosynthesis: evaluation of FabG, FabZ, and FabI as drug targets for flavonoids. J Med Chem49:3345-53 (2006) 
 
3-oxoacyl-acyl-carrier protein reductase
Name:3-oxoacyl-acyl-carrier protein reductase
Synonyms:n/a
Type:PROTEIN
Mol. Mass.:33333.53
Organism:Plasmodium falciparum
Description:ChEMBL_675156
Residue:301
BDBM7459
NameBDBM7459
TypeSmall organic molecule
Emp. Form.C15H10O6
Mol. Mass.286.2363
SMILESOc1cc(O)c2c(c1)oc(cc2=O)-c1ccc(O)c(O)c1