Reaction Details
TargetSolute carrier family 15 member 1
LigandBDBM50188481
Substrate/Competitorn/a
Meas. Tech.ChEMBL_363879 (CHEMBL863210)
EC50 30000±n/a nM
Citation Vig, BSStouch, TRTimoszyk, JKQuan, YWall, DASmith, RLFaria, TN Human PEPT1 pharmacophore distinguishes between dipeptide transport and binding. J Med Chem49:3636-44 (2006) 
 
Solute carrier family 15 member 1
Name:Solute carrier family 15 member 1
Type:PROTEIN
Mol. Mass.:78818.07
Organism:Homo sapiens (Human)
Description:ChEMBL_1488839
Residue:708
BDBM50188481
NameBDBM50188481
Synonyms:CHEMBL378907 | Phe-Tyr
TypeSmall organic molecule
Emp. Form.C18H21N3O3
Mol. Mass.327.3776
SMILESN[C@@H](Cc1ccccc1)C(=O)N[C@@H](Cc1ccc(O)cc1)C(N)=O