Reaction Details
TargetSolute carrier family 15 member 1
LigandBDBM50139892
Substrate/Competitorn/a
Meas. Tech.ChEMBL_363882 (CHEMBL863213)
IC50 70000±n/a nM
Citation Vig, BSStouch, TRTimoszyk, JKQuan, YWall, DASmith, RLFaria, TN Human PEPT1 pharmacophore distinguishes between dipeptide transport and binding. J Med Chem49:3636-44 (2006) 
 
Solute carrier family 15 member 1
Name:Solute carrier family 15 member 1
Type:PROTEIN
Mol. Mass.:78818.07
Organism:Homo sapiens (Human)
Description:ChEMBL_1488839
Residue:708
BDBM50139892
NameBDBM50139892
Synonyms:(S)-2-((S)-2-Amino-3-phenyl-propionylamino)-propionic acid CHEMBL429950 | Phe-Ala
TypeSmall organic molecule
Emp. Form.C12H16N2O3
Mol. Mass.236.267
SMILESC[C@H](NC(=O)[C@@H](N)Cc1ccccc1)C(O)=O