Reaction Details
TargetSolute carrier family 15 member 1
LigandBDBM50169199
Substrate/Competitorn/a
Meas. Tech.ChEMBL_363879 (CHEMBL863210)
EC50 400000±n/a nM
Citation Vig, BSStouch, TRTimoszyk, JKQuan, YWall, DASmith, RLFaria, TN Human PEPT1 pharmacophore distinguishes between dipeptide transport and binding. J Med Chem49:3636-44 (2006) 
 
Solute carrier family 15 member 1
Name:Solute carrier family 15 member 1
Type:PROTEIN
Mol. Mass.:78818.07
Organism:Homo sapiens (Human)
Description:ChEMBL_1488839
Residue:708
BDBM50169199
NameBDBM50169199
Synonyms:(S)-2-(2-Amino-acetylamino)-3-(3H-imidazol-4-yl)-propionic acid CHEMBL93127 | Gly-His
TypeSmall organic molecule
Emp. Form.C8H12N4O3
Mol. Mass.212.2059
SMILESNCC(=O)N[C@@H](Cc1cnc[nH]1)C(O)=O