Reaction Details
TargetSolute carrier family 15 member 1
LigandBDBM50188482
Substrate/Competitorn/a
Meas. Tech.ChEMBL_363879 (CHEMBL863210)
EC50 210000±n/a nM
Citation Vig, BSStouch, TRTimoszyk, JKQuan, YWall, DASmith, RLFaria, TN Human PEPT1 pharmacophore distinguishes between dipeptide transport and binding. J Med Chem49:3636-44 (2006) 
 
Solute carrier family 15 member 1
Name:Solute carrier family 15 member 1
Type:PROTEIN
Mol. Mass.:78818.07
Organism:Homo sapiens (Human)
Description:ChEMBL_1488839
Residue:708
BDBM50188482
NameBDBM50188482
Synonyms:CHEMBL209341 | Gly-Leu-Gly
TypeSmall organic molecule
Emp. Form.C10H19N3O4
Mol. Mass.245.2756
SMILESCC(C)C[C@H](NC(=O)CN)C(=O)NCC(O)=O