Reaction Details
TargetSolute carrier family 15 member 1
LigandBDBM50188502
Substrate/Competitorn/a
Meas. Tech.ChEMBL_363879 (CHEMBL863210)
EC50 440000±n/a nM
Citation Vig, BSStouch, TRTimoszyk, JKQuan, YWall, DASmith, RLFaria, TN Human PEPT1 pharmacophore distinguishes between dipeptide transport and binding. J Med Chem49:3636-44 (2006) 
 
Solute carrier family 15 member 1
Name:Solute carrier family 15 member 1
Type:PROTEIN
Mol. Mass.:78818.07
Organism:Homo sapiens (Human)
Description:ChEMBL_1488839
Residue:708
BDBM50188502
NameBDBM50188502
Synonyms:(S)-3-Amino-N-carboxymethyl-succinamic acid CHEMBL421171
TypeSmall organic molecule
Emp. Form.C6H10N2O5
Mol. Mass.190.154
SMILESN[C@@H](CC(O)=O)C(=O)NCC(O)=O