Reaction Details
TargetSolute carrier family 15 member 1
LigandBDBM50188509
Substrate/Competitorn/a
Meas. Tech.ChEMBL_363882 (CHEMBL863213)
IC50 230000±n/a nM
Citation Vig, BSStouch, TRTimoszyk, JKQuan, YWall, DASmith, RLFaria, TN Human PEPT1 pharmacophore distinguishes between dipeptide transport and binding. J Med Chem49:3636-44 (2006) 
 
Solute carrier family 15 member 1
Name:Solute carrier family 15 member 1
Type:PROTEIN
Mol. Mass.:78818.07
Organism:Homo sapiens (Human)
Description:ChEMBL_1488839
Residue:708
BDBM50188509
NameBDBM50188509
Synonyms:Ac-Phe-di-iodo-Tyr | CHEMBL378713
TypeSmall organic molecule
Emp. Form.C20H21I2N3O4
Mol. Mass.621.2074
SMILESCC(=O)N[C@@H](Cc1ccccc1)C(=O)N[C@@H](Cc1ccc(O)cc1)C(=O)N(I)I