Reaction Details
TargetSolute carrier family 15 member 1
LigandBDBM50188510
Substrate/Competitorn/a
Meas. Tech.ChEMBL_363879 (CHEMBL863210)
EC50 1600000±n/a nM
Citation Vig, BSStouch, TRTimoszyk, JKQuan, YWall, DASmith, RLFaria, TN Human PEPT1 pharmacophore distinguishes between dipeptide transport and binding. J Med Chem49:3636-44 (2006) 
 
Solute carrier family 15 member 1
Name:Solute carrier family 15 member 1
Type:PROTEIN
Mol. Mass.:78818.07
Organism:Homo sapiens (Human)
Description:ChEMBL_1488839
Residue:708
BDBM50188510
NameBDBM50188510
Synonyms:CHEMBL209083 | Pro-Ser
TypeSmall organic molecule
Emp. Form.C8H14N2O4
Mol. Mass.202.2078
SMILESOC[C@H](NC(=O)[C@@H]1CCCN1)C(O)=O