Reaction Details
TargetSolute carrier family 15 member 1
LigandBDBM50188508
Substrate/Competitorn/a
Meas. Tech.ChEMBL_363879 (CHEMBL863210)
EC50 140000±n/a nM
Citation Vig, BSStouch, TRTimoszyk, JKQuan, YWall, DASmith, RLFaria, TN Human PEPT1 pharmacophore distinguishes between dipeptide transport and binding. J Med Chem49:3636-44 (2006) 
 
Solute carrier family 15 member 1
Name:Solute carrier family 15 member 1
Type:PROTEIN
Mol. Mass.:78818.07
Organism:Homo sapiens (Human)
Description:ChEMBL_1488839
Residue:708
BDBM50188508
NameBDBM50188508
Synonyms:(S)-2-(2-Amino-acetylamino)-3-(4-hydroxy-phenyl)-propionic acid CHEMBL53400 | Gly-Tyr
TypeSmall organic molecule
Emp. Form.C11H14N2O4
Mol. Mass.238.2399
SMILESNCC(=O)N[C@@H](Cc1ccc(O)cc1)C(O)=O