Reaction Details
TargetSolute carrier family 15 member 1
LigandBDBM50188516
Substrate/Competitorn/a
Meas. Tech.ChEMBL_363879 (CHEMBL863210)
EC50 540000±n/a nM
Citation Vig, BSStouch, TRTimoszyk, JKQuan, YWall, DASmith, RLFaria, TN Human PEPT1 pharmacophore distinguishes between dipeptide transport and binding. J Med Chem49:3636-44 (2006) 
 
Solute carrier family 15 member 1
Name:Solute carrier family 15 member 1
Type:PROTEIN
Mol. Mass.:78818.07
Organism:Homo sapiens (Human)
Description:ChEMBL_1488839
Residue:708
BDBM50188516
NameBDBM50188516
Synonyms:2-(2-amino-N-methylacetamido)acetic acid Gly-Sar [(2-Amino-acetyl)-methyl-amino]-acetic acid | [(ammonioacetyl)(methyl)amino]acetate
TypeSmall organic molecule
Emp. Form.C5H10N2O3
Mol. Mass.146.1445
SMILESCN(CC(O)=O)C(=O)CN