Reaction Details
TargetSolute carrier family 15 member 1
LigandBDBM50188511
Substrate/Competitorn/a
Meas. Tech.ChEMBL_363882 (CHEMBL863213)
IC50 310000±n/a nM
Citation Vig, BSStouch, TRTimoszyk, JKQuan, YWall, DASmith, RLFaria, TN Human PEPT1 pharmacophore distinguishes between dipeptide transport and binding. J Med Chem49:3636-44 (2006) 
 
Solute carrier family 15 member 1
Name:Solute carrier family 15 member 1
Type:PROTEIN
Mol. Mass.:78818.07
Organism:Homo sapiens (Human)
Description:ChEMBL_1488839
Residue:708
BDBM50188511
NameBDBM50188511
Synonyms:Asp-Val | CHEMBL441685
TypeSmall organic molecule
Emp. Form.C9H16N2O5
Mol. Mass.232.2337
SMILESCC(C)[C@H](NC(=O)[C@@H](N)CC(O)=O)C(O)=O