Reaction Details
TargetSolute carrier family 15 member 1
LigandBDBM50188528
Substrate/Competitorn/a
Meas. Tech.ChEMBL_363879 (CHEMBL863210)
EC50 100000±n/a nM
Citation Vig, BSStouch, TRTimoszyk, JKQuan, YWall, DASmith, RLFaria, TN Human PEPT1 pharmacophore distinguishes between dipeptide transport and binding. J Med Chem49:3636-44 (2006) 
 
Solute carrier family 15 member 1
Name:Solute carrier family 15 member 1
Type:PROTEIN
Mol. Mass.:78818.07
Organism:Homo sapiens (Human)
Description:ChEMBL_1488839
Residue:708
BDBM50188528
NameBDBM50188528
Synonyms:CHEMBL438960 | Gln-Gln
TypeSmall organic molecule
Emp. Form.C10H18N4O5
Mol. Mass.274.2737
SMILESN[C@@H](CCC(N)=O)C(=O)N[C@@H](CCC(N)=O)C(O)=O