Reaction Details
TargetSolute carrier family 15 member 1
LigandBDBM50169195
Substrate/Competitorn/a
Meas. Tech.ChEMBL_363882 (CHEMBL863213)
IC50 9160000±n/a nM
Citation Vig, BSStouch, TRTimoszyk, JKQuan, YWall, DASmith, RLFaria, TN Human PEPT1 pharmacophore distinguishes between dipeptide transport and binding. J Med Chem49:3636-44 (2006) 
 
Solute carrier family 15 member 1
Name:Solute carrier family 15 member 1
Type:PROTEIN
Mol. Mass.:78818.07
Organism:Homo sapiens (Human)
Description:ChEMBL_1488839
Residue:708
BDBM50169195
NameBDBM50169195
Synonyms:(S)-2-[((S)-Pyrrolidine-2-carbonyl)-amino]-succinic acid Pro-Asp
TypeSmall organic molecule
Emp. Form.C9H14N2O5
Mol. Mass.230.2179
SMILESOC(=O)C[C@H](NC(=O)[C@@H]1CCCN1)C(O)=O