Reaction Details
TargetSolute carrier family 15 member 1
LigandBDBM50139894
Substrate/Competitorn/a
Meas. Tech.ChEMBL_363882 (CHEMBL863213)
IC50 170000±n/a nM
Citation Vig, BSStouch, TRTimoszyk, JKQuan, YWall, DASmith, RLFaria, TN Human PEPT1 pharmacophore distinguishes between dipeptide transport and binding. J Med Chem49:3636-44 (2006) 
 
Solute carrier family 15 member 1
Name:Solute carrier family 15 member 1
Type:PROTEIN
Mol. Mass.:78818.07
Organism:Homo sapiens (Human)
Description:ChEMBL_1488839
Residue:708
BDBM50139894
NameBDBM50139894
Synonyms:((S)-2-Amino-3-phenyl-propionylamino)-acetic acid (2-Amino-3-phenyl-propionylamino)-acetic acid Phe-Gly
TypeSmall organic molecule
Emp. Form.C11H14N2O3
Mol. Mass.222.2405
SMILESN[C@@H](Cc1ccccc1)C(=O)NCC(O)=O