Reaction Details
TargetReverse transcriptase/RNaseH
LigandBDBM50184082
Substrate/Competitorn/a
Meas. Tech.ChEMBL_364650 (CHEMBL854191)
IC50 800±n/a nM
Citation Krajewski, KZhang, YParrish, DDeschamps, JRoller, PPPathak, VK New HIV-1 reverse transcriptase inhibitors based on a tricyclic benzothiophene scaffold: synthesis, resolution, and inhibitory activity. Bioorg Med Chem Lett16:3034-8 (2006) 
 
Reverse transcriptase/RNaseH
Name:Reverse transcriptase/RNaseH
Type:PROTEIN
Mol. Mass.:65229.15
Organism:Human immunodeficiency virus 1
Description:ChEMBL_1473730
Residue:566
BDBM50184082
NameBDBM50184082
Synonyms:(R,R)-dimethyl-1-(1-piperidynyl)cyclobuta[b][1]benzothiophene-2,2a(7bH)-dicarboxylate | CHEMBL207123
TypeSmall organic molecule
Emp. Form.C18H19NO4S
Mol. Mass.345.413
SMILESCOC(=O)C1=C([C@H]2c3ccccc3S[C@@]12C(=O)OC)N1CCCC1