Reaction Details
TargetReverse transcriptase/RNaseH
LigandBDBM50184089
Substrate/Competitorn/a
Meas. Tech.ChEMBL_364650 (CHEMBL854191)
IC50 5100±n/a nM
Citation Krajewski, KZhang, YParrish, DDeschamps, JRoller, PPPathak, VK New HIV-1 reverse transcriptase inhibitors based on a tricyclic benzothiophene scaffold: synthesis, resolution, and inhibitory activity. Bioorg Med Chem Lett16:3034-8 (2006) 
 
Reverse transcriptase/RNaseH
Name:Reverse transcriptase/RNaseH
Type:PROTEIN
Mol. Mass.:65229.15
Organism:Human immunodeficiency virus 1
Description:ChEMBL_1473730
Residue:566
BDBM50184089
NameBDBM50184089
Synonyms:(R,R/S,S)-2-(2,5-dihydro-pyrrol-1-yl)-2aH-7-thia-cyclobuta[a]indene-1,7a-dicarboxylic acid dimethyl ester | CHEMBL377493
TypeSmall organic molecule
Emp. Form.C18H17NO4S
Mol. Mass.343.397
SMILESCOC(=O)C1=C(C2c3ccccc3SC12C(=O)OC)N1CC=CC1