Reaction Details
TargetReverse transcriptase/RNaseH
LigandBDBM50184095
Substrate/Competitorn/a
Meas. Tech.ChEMBL_364650 (CHEMBL854191)
IC50>10000±n/a nM
Citation Krajewski, KZhang, YParrish, DDeschamps, JRoller, PPPathak, VK New HIV-1 reverse transcriptase inhibitors based on a tricyclic benzothiophene scaffold: synthesis, resolution, and inhibitory activity. Bioorg Med Chem Lett16:3034-8 (2006) 
 
Reverse transcriptase/RNaseH
Name:Reverse transcriptase/RNaseH
Type:PROTEIN
Mol. Mass.:65229.15
Organism:Human immunodeficiency virus 1
Description:ChEMBL_1473730
Residue:566
BDBM50184095
NameBDBM50184095
Synonyms:(R,R/S,S)-2-azetidin-1-yl-2aH-7-thia-cyclobuta[a]indene-1,7a-dicarboxylic acid dimethyl ester | CHEMBL210334
TypeSmall organic molecule
Emp. Form.C17H17NO4S
Mol. Mass.331.386
SMILESCOC(=O)C1=C(C2c3ccccc3SC12C(=O)OC)N1CCC1