Reaction Details
TargetComplement C3
LigandBDBM50191375
Substrate/Competitorn/a
Meas. Tech.ChEMBL_365467 (CHEMBL869093)
IC50 205±n/a nM
Citation Katragadda, MMagotti, PSfyroera, GLambris, JD Hydrophobic effect and hydrogen bonds account for the improved activity of a complement inhibitor, compstatin. J Med Chem49:4616-22 (2006) 
 
Complement C3
Name:Complement C3
Type:Enzyme
Mol. Mass.:187142.34
Organism:Homo sapiens (Human)
Description:P01024
Residue:1663
BDBM50191375
NameBDBM50191375
Synonyms:Ac-ICV(1MeW)QDWGAHRCT-NH2 | CHEMBL427239
TypeSmall organic molecule
Emp. Form.C72H102FN21O19S2
Mol. Mass.1648.838
SMILESCC[C@H](C)[C@H](NC(C)=O)C(=O)N[C@@H](CS)C(=O)N[C@@H](C(C)C)C(=O)N[C@@H](Cc1cn(C)c2ccccc12)C(=O)N[C@@H](CCC(N)=O)C(=O)N[C@@H](CC(O)=O)C(=O)N[C@@H](Cc1c[nH]c2ccc(F)cc12)C(=O)NCC(=O)N[C@@H](C)C(=O)N[C@@H](Cc1cnc[nH]1)C(=O)N[C@@H](CCCN=C(N)N)C(=O)N[C@@H](CS)C(=O)N[C@@H]([C@@H](C)O)C(O)=O