Reaction Details
TargetHeat shock protein HSP 90-alpha/90-beta
LigandBDBM50030868
Substrate/Competitorn/a
Meas. Tech.ChEMBL_365497 (CHEMBL867913)
EC50 17±n/a nM
Citation Ge, JNormant, EPorter, JRAli, JADembski, MSGao, YGeorges, ATGrenier, LPak, RHPatterson, JSydor, JRTibbitts, TTTong, JKAdams, JPalombella, VJ Design, synthesis, and biological evaluation of hydroquinone derivatives of 17-amino-17-demethoxygeldanamycin as potent, water-soluble inhibitors of Hsp90. J Med Chem49:4606-15 (2006) 
 
Heat shock protein HSP 90-alpha/90-beta
Name:Heat shock protein HSP 90-alpha/90-beta
Type:n/a
Mol. Mass.:n/a
Description:ASSAY_ID of EBI is 29664
Components:This complex has 2 components.
Component 1
Name:Heat shock protein HSP 90-alpha
Synonyms:HS90A_HUMAN HSP86 HSP90AA1 HSPCA Heat shock 86 kDa Heat shock protein HSP 90-alpha (HSP90) LAP-2 Lipopolysaccharide-associated protein 2 heat shock protein 90kDa alpha (cytosolic), class A member 1 isoform 2
Type:Molecular Chaperone
Mol. Mass.:84623.45
Organism:Homo sapiens (Human)
Description:P07900
Residue:732
Component 2
Name:Heat shock protein HSP 90-beta
Synonyms:HS90B_HUMAN HSP 90 HSP90B HSPCB Heat shock protein HSP 90 (Hsp90)
Type:Molecular Chaperone
Mol. Mass.:83229.45
Organism:Homo sapiens (Human)
Description:P08238
Residue:724
BDBM50030868
NameBDBM50030868
Synonyms:(8S,9S,12S,13R,14S,16R)-19-amino-13-hydroxy-8,14-dimethoxy-4,10,12,16-tetramethyl-3,20,22-trioxo-2-azabicyclo[16.3.1]docosa-1(21),4,6,10,18-pentaen-9-yl carbamate 17-desmethoxy-17-aminogeldanamycin Carbamic acid (4E,6Z)-(13S,14S,17R,19S)-19-amino-13-(S)-hydroxy-8,14-dimethoxy-4,12,16-trimethyl-10-(R)-methyl-3,20,22-trioxo-2-aza-bicyclo[16.3.1]docosa-1(21),4,6,10,18-pentaen-9-yl ester | Carbamic acid (4E,6Z,10E)-(8S,9S,12S,13R,14S,16R)-19-amino-13-hydroxy-8,14-dimethoxy-4,10,12,16-tetramethyl-3,20,22-trioxo-2-aza-bicyclo[16.3.1]docosa-1(21),4,6,10,18-pentaen-9-yl ester
TypeSmall organic molecule
Emp. Form.C28H39N3O8
Mol. Mass.545.6246
SMILESCO[C@H]1CC(C)=Cc2c(N)c(O)cc(NC(=O)C(C)=CC=C[C@H](OC)[C@@H](OC(N)=O)\C(C)=C\[C@H](C)[C@H]1O)c2O