Reaction Details
TargetEndoplasmin
LigandBDBM50191367
Substrate/Competitorn/a
Meas. Tech.ChEMBL_365492 (CHEMBL867908)
EC50 119±n/a nM
Citation Ge, JNormant, EPorter, JRAli, JADembski, MSGao, YGeorges, ATGrenier, LPak, RHPatterson, JSydor, JRTibbitts, TTTong, JKAdams, JPalombella, VJ Design, synthesis, and biological evaluation of hydroquinone derivatives of 17-amino-17-demethoxygeldanamycin as potent, water-soluble inhibitors of Hsp90. J Med Chem49:4606-15 (2006) 
 
Endoplasmin
Name:Endoplasmin
Type:PROTEIN
Mol. Mass.:92464.42
Organism:Canis familiaris
Description:ChEMBL_1478277
Residue:804
BDBM50191367
NameBDBM50191367
Synonyms:17-allylamino-17-demethoxygeldanamycin hydroquinone hydrochloride CHEMBL377559
TypeSmall organic molecule
Emp. Form.C31H46N3O8
Mol. Mass.588.7117
SMILESCO[C@H]1C[C@H](C)Cc2c(O)c(NC(=O)C(C)=CC=C[C@H](OC)[C@@H](OC(N)=O)\C(C)=C\[C@H](C)[C@H]1O)cc(O)c2[NH2+]CC=C