Reaction Details
TargetMu-type opioid receptor
LigandBDBM50272081
Substrate/Competitorn/a
Meas. Tech.ChEMBL_366645 (CHEMBL865967)
Ki 0.160000±n/a nM
Citation Ballet, SSalvadori, STrapella, CBryant, SDJinsmaa, YLazarus, LHNegri, LGiannini, ELattanzi, RTourwé, DBalboni, G New 2',6'-dimethyl-L-tyrosine (Dmt) opioid peptidomimetics based on the Aba-Gly scaffold. Development of unique mu-opioid receptor ligands. J Med Chem49:3990-3 (2006) 
 
Mu-type opioid receptor
Name:Mu-type opioid receptor
Type:G Protein-Coupled Receptor (GPCR)
Mol. Mass.:44789.51
Organism:Homo sapiens (Human)
Description:P35372
Residue:400
BDBM50272081
NameBDBM50272081
Synonyms:2-[2-Amino-3-(4-hydroxy-2,6-dimethyl-phenyl)-propionyl]-1,2,3,4-tetrahydro-isoquinoline-3-carboxylic acid phenylcarbamoylmethyl-amide H-Dmt-Tic-Gly-NH-Ph
TypeSmall organic molecule
Emp. Form.C29H32N4O4
Mol. Mass.500.5888
SMILESCc1cc(O)cc(C)c1C[C@H](N)C(=O)N1Cc2ccccc2C[C@H]1C(=O)NCC(=O)Nc1ccccc1