Reaction Details
TargetGonadotropin-releasing hormone receptor
LigandBDBM50067485
Substrate/Competitorn/a
Meas. Tech.ChEMBL_367964 (CHEMBL871113)
IC50 0.6±n/a nM
Citation Imada, TCho, NImaeda, THayase, YSasaki, SKasai, SHarada, MMatsumoto, HEndo, SSuzuki, NFuruya, S Design, synthesis, and structure-activity relationships of thieno[2,3-b]pyridin-4-one derivatives as a novel class of potent, orally active, non-peptide luteinizing hormone-releasing hormone receptor antagonists. J Med Chem49:3809-25 (2006) 
 
Gonadotropin-releasing hormone receptor
Name:Gonadotropin-releasing hormone receptor
Type:Enzyme
Mol. Mass.:37749.45
Organism:Homo sapiens (Human)
Description:P30968
Residue:328
BDBM50067485
NameBDBM50067485
Synonyms:3-[(Benzyl-methyl-amino)-methyl]-7-(2,6-difluoro-benzyl)-2-(4-isobutyrylamino-phenyl)-4-oxo-4,7-dihydro-thieno[2,3-b]pyridine-5-carboxylic acid isopropyl ester; hydrochloride CHEMBL71917 | T-98475
TypeSmall organic molecule
Emp. Form.C37H37F2N3O4S
Mol. Mass.657.769
SMILESCC(C)OC(=O)c1cn(Cc2c(F)cccc2F)c2sc(c(CN(C)Cc3ccccc3)c2c1=O)-c1ccc(NC(=O)C(C)C)cc1