Reaction Details
TargetHeme oxygenase 1
LigandBDBM50183058
Substrate/Competitorn/a
Meas. Tech.ChEMBL_368935 (CHEMBL869046)
IC50 2600±n/a nM
Citation Vlahakis, JZKinobe, RTBowers, RJBrien, JFNakatsu, KSzarek, WA Imidazole-dioxolane compounds as isozyme-selective heme oxygenase inhibitors. J Med Chem49:4437-41 (2006) 
 
Heme oxygenase 1
Name:Heme oxygenase 1
Type:Enzyme
Mol. Mass.:33005.15
Organism:Rattus norvegicus (rat)
Description:HO-1 obtained from rat spleen was used in enzyme assays.
Residue:289
BDBM50183058
NameBDBM50183058
Synonyms:(2R,4S)-2-[2-(4-chlorophenyl)ethyl]-2-[(1H-imidazol-1-yl)-methyl]-4-methyl-1,3-dioxolane hydrochloride CHEMBL535613
TypeSmall organic molecule
Emp. Form.C16H19ClN2O2
Mol. Mass.306.787
SMILESC[C@H]1CO[C@@](CCc2ccc(Cl)cc2)(Cn2ccnc2)O1